{"text_format":"1","workbook":"xlsx","n_sheets":4,"sheets":["Denver","Mountain","Sheet2","Sheet3"],"not_rendered":{"charts":0,"images":0,"macros":1,"external_links":1,"defined_names":2,"comments":0,"pivot_tables":0},"unopened":[],"bounds":{"document_bytes":16777216,"sheet_cells":100000,"rows_first":2000,"rows_last":500,"rows_between":2000,"halvings":0,"cell_chars":16384,"cell_head_chars":4096},"cells_cut":0,"cells_raw":0,"read":"whole","date_system":"1900"}

{"sheet":"Denver","index":0,"n_rows":591,"n_cols":13,"rows_kept":591,"cut":false,"hidden":false,"merged":[[5,3,6,7]]}
[null,null,"Account # ",{"$f":"IF(D2=\"\",\"\",VLOOKUP(D2,Sheet2!G:K,2,FALSE))","v":""},null,null,null,null,null,null,null,{"$f":"Sheet2!G:G","v":"626 On Rood"},{"$f":"Sheet2!A:A","v":0}]
[null,null,"Account Name:",null,null,null,null,null,null,null,null,{"$f":"Sheet2!G:G","v":"7 Hermits Brewing Co"},{"$f":"Sheet2!A:A","v":1000}]
[null,null,"Address:",{"$f":"IF(D2=\"\",\"\",VLOOKUP(D2,Sheet2!G:K,3,FALSE))","v":""},null,null,null,null,null,null,null,{"$f":"Sheet2!G:G","v":"All Pro Liquors"},{"$f":"Sheet2!A:A","v":1001}]
[null,null,"City:",{"$f":"IF(D2=\"\",\"\",VLOOKUP(D2,Sheet2!G:K,5,FALSE))","v":""},null,null,null,null,null,null,null,{"$f":"Sheet2!G:G","v":"Allegria"},{"$f":"Sheet2!A:A","v":1002}]
[null,null,"Delivery Date:",null,null,null,null,null,null,null,null,{"$f":"Sheet2!G:G","v":"Alpine Wine & Spirit"},{"$f":"Sheet2!A:A","v":1003}]
[null,null,"Comments:",null,null,null,null,null,null,null,null,{"$f":"Sheet2!G:G","v":"Andy's Liquor Mart"},{"$f":"Sheet2!A:A","v":1004}]
[null,null,null,null,null,null,null,null,null,null,null,{"$f":"Sheet2!G:G","v":"Antlers Discount Liquors"},{"$f":"Sheet2!A:A","v":1005}]
["CASES","BOTTLES","ITEM # ","DESCRIPTION","FRONT LINE","CASE DISCOUNT","CASE PRICE","BOTTLE PRICE","NET",null,null,{"$f":"Sheet2!G:G","v":"Apres"},{"$f":"Sheet2!A:A","v":1007}]
[null,null,null,{"$f":"IF(C9=\"\",\"\",VLOOKUP(C9,Sheet2!A:E,2,FALSE))","v":""},{"$f":"IF(C9=\"\",\"\",VLOOKUP(C9,Sheet2!A:C,3,FALSE))","v":""},null,{"$f":"IF(C9=\"\",\"\",E9-F9)","v":""},{"$f":"IF(C9=\"\",\"\",G9/VLOOKUP(C9,Sheet2!A:E,5,FALSE))","v":""},{"$f":"IF(C9=\"\",\"\",(A9*G9)+(B9*H9))","v":""},null,null,{"$f":"Sheet2!G:G","v":"Arapahoe Basin Ski Area"},{"$f":"Sheet2!A:A","v":1008}]
[null,null,null,{"$f":"IF(C10=\"\",\"\",VLOOKUP(C10,Sheet2!A:E,2,FALSE))","v":""},{"$f":"IF(C10=\"\",\"\",VLOOKUP(C10,Sheet2!A:C,3,FALSE))","v":""},null,{"$f":"IF(C10=\"\",\"\",E10-F10)","v":""},{"$f":"IF(C10=\"\",\"\",G10/VLOOKUP(C10,Sheet2!A:E,5,FALSE))","v":""},{"$f":"IF(C10=\"\",\"\",(A10*G10)+(B10*H10))","v":""},null,null,{"$f":"Sheet2!G:G","v":"Arctic Liquors"},{"$f":"Sheet2!A:A","v":1009}]
[null,null,null,{"$f":"IF(C11=\"\",\"\",VLOOKUP(C11,Sheet2!A:E,2,FALSE))","v":""},{"$f":"IF(C11=\"\",\"\",VLOOKUP(C11,Sheet2!A:C,3,FALSE))","v":""},null,"",{"$f":"IF(C11=\"\",\"\",G11/VLOOKUP(C11,Sheet2!A:E,5,FALSE))","v":""},"",null,null,{"$f":"Sheet2!G:G","v":"Aspen Wine and Spirits"},{"$f":"Sheet2!A:A","v":1010}]
[null,null,null,{"$f":"IF(C12=\"\",\"\",VLOOKUP(C12,Sheet2!A:E,2,FALSE))","v":""},{"$f":"IF(C12=\"\",\"\",VLOOKUP(C12,Sheet2!A:C,3,FALSE))","v":""},null,"",{"$f":"IF(C12=\"\",\"\",G12/VLOOKUP(C12,Sheet2!A:E,5,FALSE))","v":""},"",null,null,{"$f":"Sheet2!G:G","v":"Aspen Wine Guild"},{"$f":"Sheet2!A:A","v":1020}]
[null,null,null,{"$f":"IF(C13=\"\",\"\",VLOOKUP(C13,Sheet2!A:E,2,FALSE))","v":""},{"$f":"IF(C13=\"\",\"\",VLOOKUP(C13,Sheet2!A:C,3,FALSE))","v":""},null,"",{"$f":"IF(C13=\"\",\"\",G13/VLOOKUP(C13,Sheet2!A:E,5,FALSE))","v":""},"",null,null,{"$f":"Sheet2!G:G","v":"Avon Liquors"},{"$f":"Sheet2!A:A","v":1021}]
[null,null,null,{"$f":"IF(C14=\"\",\"\",VLOOKUP(C14,Sheet2!A:E,2,FALSE))","v":""},{"$f":"IF(C14=\"\",\"\",VLOOKUP(C14,Sheet2!A:C,3,FALSE))","v":""},null,"",{"$f":"IF(C14=\"\",\"\",G14/VLOOKUP(C14,Sheet2!A:E,5,FALSE))","v":""},"",null,null,{"$f":"Sheet2!G:G","v":"Barley, The"},{"$f":"Sheet2!A:A","v":1022}]
[null,null,null,{"$f":"IF(C15=\"\",\"\",VLOOKUP(C15,Sheet2!A:E,2,FALSE))","v":""},{"$f":"IF(C15=\"\",\"\",VLOOKUP(C15,Sheet2!A:C,3,FALSE))","v":""},null,"",{"$f":"IF(C15=\"\",\"\",G15/VLOOKUP(C15,Sheet2!A:E,5,FALSE))","v":""},"",null,null,{"$f":"Sheet2!G:G","v":"Bart & Yeti's"},{"$f":"Sheet2!A:A","v":1023}]
[null,null,null,{"$f":"IF(C16=\"\",\"\",VLOOKUP(C16,Sheet2!A:E,2,FALSE))","v":""},{"$f":"IF(C16=\"\",\"\",VLOOKUP(C16,Sheet2!A:C,3,FALSE))","v":""},null,"",{"$f":"IF(C16=\"\",\"\",G16/VLOOKUP(C16,Sheet2!A:E,5,FALSE))","v":""},"",null,null,{"$f":"Sheet2!G:G","v":"Beaver Liquors"},{"$f":"Sheet2!A:A","v":1024}]
[null,null,null,{"$f":"IF(C17=\"\",\"\",VLOOKUP(C17,Sheet2!A:E,2,FALSE))","v":""},{"$f":"IF(C17=\"\",\"\",VLOOKUP(C17,Sheet2!A:C,3,FALSE))","v":""},null,"",{"$f":"IF(C17=\"\",\"\",G17/VLOOKUP(C17,Sheet2!A:E,5,FALSE))","v":""},"",null,null,{"$f":"Sheet2!G:G","v":"Big House Burgers"},{"$f":"Sheet2!A:A","v":1109}]
[null,null,null,{"$f":"IF(C18=\"\",\"\",VLOOKUP(C18,Sheet2!A:E,2,FALSE))","v":""},{"$f":"IF(C18=\"\",\"\",VLOOKUP(C18,Sheet2!A:C,3,FALSE))","v":""},null,"",{"$f":"IF(C18=\"\",\"\",G18/VLOOKUP(C18,Sheet2!A:E,5,FALSE))","v":""},"",null,null,{"$f":"Sheet2!G:G","v":"Bistro CV"},{"$f":"Sheet2!A:A","v":1209}]
[null,null,null,{"$f":"IF(C19=\"\",\"\",VLOOKUP(C19,Sheet2!A:E,2,FALSE))","v":""},{"$f":"IF(C19=\"\",\"\",VLOOKUP(C19,Sheet2!A:C,3,FALSE))","v":""},null,"",{"$f":"IF(C19=\"\",\"\",G19/VLOOKUP(C19,Sheet2!A:E,5,FALSE))","v":""},"",null,null,{"$f":"Sheet2!G:G","v":"Black Diamond Bistro"},{"$f":"Sheet2!A:A","v":1220}]
[null,null,null,{"$f":"IF(C20=\"\",\"\",VLOOKUP(C20,Sheet2!A:E,2,FALSE))","v":""},{"$f":"IF(C20=\"\",\"\",VLOOKUP(C20,Sheet2!A:C,3,FALSE))","v":""},null,"",{"$f":"IF(C20=\"\",\"\",G20/VLOOKUP(C20,Sheet2!A:E,5,FALSE))","v":""},"",null,null,{"$f":"Sheet2!G:G","v":"Blu's"},{"$f":"Sheet2!A:A","v":1406}]
[null,null,null,{"$f":"IF(C21=\"\",\"\",VLOOKUP(C21,Sheet2!A:E,2,FALSE))","v":""},{"$f":"IF(C21=\"\",\"\",VLOOKUP(C21,Sheet2!A:C,3,FALSE))","v":""},null,"",{"$f":"IF(C21=\"\",\"\",G21/VLOOKUP(C21,Sheet2!A:E,5,FALSE))","v":""},"",null,null,{"$f":"Sheet2!G:G","v":"Bookcliff Country Club"},{"$f":"Sheet2!A:A","v":1450}]
[null,null,null,{"$f":"IF(C22=\"\",\"\",VLOOKUP(C22,Sheet2!A:E,2,FALSE))","v":""},{"$f":"IF(C22=\"\",\"\",VLOOKUP(C22,Sheet2!A:C,3,FALSE))","v":""},null,"",{"$f":"IF(C22=\"\",\"\",G22/VLOOKUP(C22,Sheet2!A:E,5,FALSE))","v":""},"",null,null,{"$f":"Sheet2!G:G","v":"Bookcliff Liquors"},{"$f":"Sheet2!A:A","v":1510}]
[null,null,null,{"$f":"IF(C23=\"\",\"\",VLOOKUP(C23,Sheet2!A:E,2,FALSE))","v":""},{"$f":"IF(C23=\"\",\"\",VLOOKUP(C23,Sheet2!A:C,3,FALSE))","v":""},null,"",{"$f":"IF(C23=\"\",\"\",G23/VLOOKUP(C23,Sheet2!A:E,5,FALSE))","v":""},"",null,null,{"$f":"Sheet2!G:G","v":"Bottle Pass Liquors"},{"$f":"Sheet2!A:A","v":1515}]
[null,null,null,{"$f":"IF(C24=\"\",\"\",VLOOKUP(C24,Sheet2!A:E,2,FALSE))","v":""},{"$f":"IF(C24=\"\",\"\",VLOOKUP(C24,Sheet2!A:C,3,FALSE))","v":""},null,"",{"$f":"IF(C24=\"\",\"\",G24/VLOOKUP(C24,Sheet2!A:E,5,FALSE))","v":""},"",null,null,{"$f":"Sheet2!G:G","v":"Bottle Shop Liquor"},{"$f":"Sheet2!A:A","v":1550}]
[null,null,null,{"$f":"IF(C25=\"\",\"\",VLOOKUP(C25,Sheet2!A:E,2,FALSE))","v":""},{"$f":"IF(C25=\"\",\"\",VLOOKUP(C25,Sheet2!A:C,3,FALSE))","v":""},null,"",{"$f":"IF(C25=\"\",\"\",G25/VLOOKUP(C25,Sheet2!A:E,5,FALSE))","v":""},"",null,null,{"$f":"Sheet2!G:G","v":"Breckenridge Ale House"},{"$f":"Sheet2!A:A","v":1551}]
[null,null,null,{"$f":"IF(C26=\"\",\"\",VLOOKUP(C26,Sheet2!A:E,2,FALSE))","v":""},{"$f":"IF(C26=\"\",\"\",VLOOKUP(C26,Sheet2!A:C,3,FALSE))","v":""},null,"",{"$f":"IF(C26=\"\",\"\",G26/VLOOKUP(C26,Sheet2!A:E,5,FALSE))","v":""},"",null,null,{"$f":"Sheet2!G:G","v":"Broadway Liquors"},{"$f":"Sheet2!A:A","v":2006}]
[null,null,null,{"$f":"IF(C27=\"\",\"\",VLOOKUP(C27,Sheet2!A:E,2,FALSE))","v":""},{"$f":"IF(C27=\"\",\"\",VLOOKUP(C27,Sheet2!A:C,3,FALSE))","v":""},null,"",{"$f":"IF(C27=\"\",\"\",G27/VLOOKUP(C27,Sheet2!A:E,5,FALSE))","v":""},"",null,null,{"$f":"Sheet2!G:G","v":"C&H Spirit Solutions"},{"$f":"Sheet2!A:A","v":2058}]
[null,null,null,{"$f":"IF(C28=\"\",\"\",VLOOKUP(C28,Sheet2!A:E,2,FALSE))","v":""},{"$f":"IF(C28=\"\",\"\",VLOOKUP(C28,Sheet2!A:C,3,FALSE))","v":""},null,"",{"$f":"IF(C28=\"\",\"\",G28/VLOOKUP(C28,Sheet2!A:E,5,FALSE))","v":""},"",null,null,{"$f":"Sheet2!G:G","v":"Carelli's Pizzeria"},{"$f":"Sheet2!A:A","v":3008}]
[null,null,null,{"$f":"IF(C29=\"\",\"\",VLOOKUP(C29,Sheet2!A:E,2,FALSE))","v":""},{"$f":"IF(C29=\"\",\"\",VLOOKUP(C29,Sheet2!A:C,3,FALSE))","v":""},null,"",{"$f":"IF(C29=\"\",\"\",G29/VLOOKUP(C29,Sheet2!A:E,5,FALSE))","v":""},"",null,null,{"$f":"Sheet2!G:G","v":"Carl's Pharmacy"},{"$f":"Sheet2!A:A","v":3081}]
[null,null,null,null,null,null,null,"Total:",{"$f":"SUM(I9:I29)","v":0},null,null,{"$f":"Sheet2!G:G","v":"Carl's Tavern"},{"$f":"Sheet2!A:A","v":3082}]
{"$rows_left_out":562}
{"sheet":"Mountain","index":1,"n_rows":590,"n_cols":13,"rows_kept":590,"cut":false,"hidden":false,"merged":[[6,3,7,7]]}
[null,null,"Account # ",{"$f":"IF($D$2=\"\",\"\",VLOOKUP($D$2,Sheet2!G:K,2,FALSE))","v":""},null,null,null,null,null,null,null,{"$f":"Sheet2!G:G","v":"626 On Rood"},{"$f":"Sheet2!A:A","v":0}]
[null,null,"Account Name:",null,null,null,null,null,null,null,null,{"$f":"Sheet2!G:G","v":"7 Hermits Brewing Co"},{"$f":"Sheet2!A:A","v":1000}]
[null,null,"Address:",{"$f":"IF($D$2=\"\",\"\",VLOOKUP($D$2,Sheet2!G:K,3,FALSE))","v":""},null,null,null,null,null,null,null,{"$f":"Sheet2!G:G","v":"All Pro Liquors"},{"$f":"Sheet2!A:A","v":1001}]
[null,null,"Address 2:",{"$f":"IF($D$2=\"\",\"\",VLOOKUP($D$2,Sheet2!G:K,4,FALSE))","v":""},null,null,null,null,null,null,null,{"$f":"Sheet2!G:G","v":"Allegria"},{"$f":"Sheet2!A:A","v":1002}]
[null,null,"City:",{"$f":"IF($D$2=\"\",\"\",VLOOKUP($D$2,Sheet2!G:K,5,FALSE))","v":""},null,null,null,null,null,null,null,{"$f":"Sheet2!G:G","v":"Alpine Wine & Spirit"},{"$f":"Sheet2!A:A","v":1003}]
[null,null,"Delivery Date:",null,null,null,null,null,null,null,null,{"$f":"Sheet2!G:G","v":"Andy's Liquor Mart"},{"$f":"Sheet2!A:A","v":1004}]
[null,null,"Comments:",null,null,null,null,null,null,null,null,{"$f":"Sheet2!G:G","v":"Antlers Discount Liquors"},{"$f":"Sheet2!A:A","v":1005}]
[null,null,null,null,null,null,null,null,null,null,null,{"$f":"Sheet2!G:G","v":"Apres"},{"$f":"Sheet2!A:A","v":1007}]
["CASES","BOTTLES","ITEM # ","DESCRIPTION","FRONT LINE","CASE DISCOUNT","CASE PRICE","BOTTLE PRICE","NET",null,null,{"$f":"Sheet2!G:G","v":"Arapahoe Basin Ski Area"},{"$f":"Sheet2!A:A","v":1008}]
[null,null,null,{"$f":"IF(C10=\"\",\"\",VLOOKUP(C10,Sheet2!$A:$B,2,FALSE))","v":""},{"$f":"IF(C10=\"\",\"\",VLOOKUP(C10,Sheet2!$A:$D,4,FALSE))","v":""},null,{"$f":"IF(C10=\"\",\"\",E10-F10)","v":""},{"$f":"IF(C10=\"\",\"\",G10/VLOOKUP(C10,Sheet2!$A:$E,5,FALSE))","v":""},{"$f":"IF(C10=\"\",\"\",(A10*G10)+(B10*H10))","v":""},null,null,{"$f":"Sheet2!G:G","v":"Arctic Liquors"},{"$f":"Sheet2!A:A","v":1009}]
[null,null,null,{"$f":"IF(C11=\"\",\"\",VLOOKUP(C11,Sheet2!$A:$B,2,FALSE))","v":""},{"$f":"IF(C11=\"\",\"\",VLOOKUP(C11,Sheet2!$A:$D,4,FALSE))","v":""},null,{"$f":"IF(C11=\"\",\"\",E11-F11)","v":""},{"$f":"IF(C11=\"\",\"\",G11/VLOOKUP(C11,Sheet2!$A:$E,5,FALSE))","v":""},{"$f":"IF(C11=\"\",\"\",(A11*G11)+(B11*H11))","v":""},null,null,{"$f":"Sheet2!G:G","v":"Aspen Wine and Spirits"},{"$f":"Sheet2!A:A","v":1010}]
[null,null,null,{"$f":"IF(C12=\"\",\"\",VLOOKUP(C12,Sheet2!$A:$B,2,FALSE))","v":""},{"$f":"IF(C12=\"\",\"\",VLOOKUP(C12,Sheet2!$A:$D,4,FALSE))","v":""},null,"",{"$f":"IF(C12=\"\",\"\",G12/VLOOKUP(C12,Sheet2!$A:$E,5,FALSE))","v":""},"",null,null,{"$f":"Sheet2!G:G","v":"Aspen Wine Guild"},{"$f":"Sheet2!A:A","v":1020}]
[null,null,null,{"$f":"IF(C13=\"\",\"\",VLOOKUP(C13,Sheet2!$A:$B,2,FALSE))","v":""},{"$f":"IF(C13=\"\",\"\",VLOOKUP(C13,Sheet2!$A:$D,4,FALSE))","v":""},null,"",{"$f":"IF(C13=\"\",\"\",G13/VLOOKUP(C13,Sheet2!$A:$E,5,FALSE))","v":""},"",null,null,{"$f":"Sheet2!G:G","v":"Avon Liquors"},{"$f":"Sheet2!A:A","v":1021}]
[null,null,null,{"$f":"IF(C14=\"\",\"\",VLOOKUP(C14,Sheet2!$A:$B,2,FALSE))","v":""},{"$f":"IF(C14=\"\",\"\",VLOOKUP(C14,Sheet2!$A:$D,4,FALSE))","v":""},null,"",{"$f":"IF(C14=\"\",\"\",G14/VLOOKUP(C14,Sheet2!$A:$E,5,FALSE))","v":""},"",null,null,{"$f":"Sheet2!G:G","v":"Barley, The"},{"$f":"Sheet2!A:A","v":1022}]
[null,null,null,{"$f":"IF(C15=\"\",\"\",VLOOKUP(C15,Sheet2!$A:$B,2,FALSE))","v":""},{"$f":"IF(C15=\"\",\"\",VLOOKUP(C15,Sheet2!$A:$D,4,FALSE))","v":""},null,"",{"$f":"IF(C15=\"\",\"\",G15/VLOOKUP(C15,Sheet2!$A:$E,5,FALSE))","v":""},"",null,null,{"$f":"Sheet2!G:G","v":"Bart & Yeti's"},{"$f":"Sheet2!A:A","v":1023}]
[null,null,null,{"$f":"IF(C16=\"\",\"\",VLOOKUP(C16,Sheet2!$A:$B,2,FALSE))","v":""},{"$f":"IF(C16=\"\",\"\",VLOOKUP(C16,Sheet2!$A:$D,4,FALSE))","v":""},null,"",{"$f":"IF(C16=\"\",\"\",G16/VLOOKUP(C16,Sheet2!$A:$E,5,FALSE))","v":""},"",null,null,{"$f":"Sheet2!G:G","v":"Beaver Liquors"},{"$f":"Sheet2!A:A","v":1024}]
[null,null,null,{"$f":"IF(C17=\"\",\"\",VLOOKUP(C17,Sheet2!$A:$B,2,FALSE))","v":""},{"$f":"IF(C17=\"\",\"\",VLOOKUP(C17,Sheet2!$A:$D,4,FALSE))","v":""},null,"",{"$f":"IF(C17=\"\",\"\",G17/VLOOKUP(C17,Sheet2!$A:$E,5,FALSE))","v":""},"",null,null,{"$f":"Sheet2!G:G","v":"Big House Burgers"},{"$f":"Sheet2!A:A","v":1109}]
[null,null,null,{"$f":"IF(C18=\"\",\"\",VLOOKUP(C18,Sheet2!$A:$B,2,FALSE))","v":""},{"$f":"IF(C18=\"\",\"\",VLOOKUP(C18,Sheet2!$A:$D,4,FALSE))","v":""},null,"",{"$f":"IF(C18=\"\",\"\",G18/VLOOKUP(C18,Sheet2!$A:$E,5,FALSE))","v":""},"",null,null,{"$f":"Sheet2!G:G","v":"Bistro CV"},{"$f":"Sheet2!A:A","v":1209}]
[null,null,null,{"$f":"IF(C19=\"\",\"\",VLOOKUP(C19,Sheet2!$A:$B,2,FALSE))","v":""},{"$f":"IF(C19=\"\",\"\",VLOOKUP(C19,Sheet2!$A:$D,4,FALSE))","v":""},null,"",{"$f":"IF(C19=\"\",\"\",G19/VLOOKUP(C19,Sheet2!$A:$E,5,FALSE))","v":""},"",null,null,{"$f":"Sheet2!G:G","v":"Black Diamond Bistro"},{"$f":"Sheet2!A:A","v":1220}]
[null,null,null,{"$f":"IF(C20=\"\",\"\",VLOOKUP(C20,Sheet2!$A:$B,2,FALSE))","v":""},{"$f":"IF(C20=\"\",\"\",VLOOKUP(C20,Sheet2!$A:$D,4,FALSE))","v":""},null,"",{"$f":"IF(C20=\"\",\"\",G20/VLOOKUP(C20,Sheet2!$A:$E,5,FALSE))","v":""},"",null,null,{"$f":"Sheet2!G:G","v":"Blu's"},{"$f":"Sheet2!A:A","v":1406}]
[null,null,null,{"$f":"IF(C21=\"\",\"\",VLOOKUP(C21,Sheet2!$A:$B,2,FALSE))","v":""},{"$f":"IF(C21=\"\",\"\",VLOOKUP(C21,Sheet2!$A:$D,4,FALSE))","v":""},null,"",{"$f":"IF(C21=\"\",\"\",G21/VLOOKUP(C21,Sheet2!$A:$E,5,FALSE))","v":""},"",null,null,{"$f":"Sheet2!G:G","v":"Bookcliff Country Club"},{"$f":"Sheet2!A:A","v":1450}]
[null,null,null,{"$f":"IF(C22=\"\",\"\",VLOOKUP(C22,Sheet2!$A:$B,2,FALSE))","v":""},{"$f":"IF(C22=\"\",\"\",VLOOKUP(C22,Sheet2!$A:$D,4,FALSE))","v":""},null,"",{"$f":"IF(C22=\"\",\"\",G22/VLOOKUP(C22,Sheet2!$A:$E,5,FALSE))","v":""},"",null,null,{"$f":"Sheet2!G:G","v":"Bookcliff Liquors"},{"$f":"Sheet2!A:A","v":1510}]
[null,null,null,{"$f":"IF(C23=\"\",\"\",VLOOKUP(C23,Sheet2!$A:$B,2,FALSE))","v":""},{"$f":"IF(C23=\"\",\"\",VLOOKUP(C23,Sheet2!$A:$D,4,FALSE))","v":""},null,"",{"$f":"IF(C23=\"\",\"\",G23/VLOOKUP(C23,Sheet2!$A:$E,5,FALSE))","v":""},"",null,null,{"$f":"Sheet2!G:G","v":"Bottle Pass Liquors"},{"$f":"Sheet2!A:A","v":1515}]
[null,null,null,{"$f":"IF(C24=\"\",\"\",VLOOKUP(C24,Sheet2!$A:$B,2,FALSE))","v":""},{"$f":"IF(C24=\"\",\"\",VLOOKUP(C24,Sheet2!$A:$D,4,FALSE))","v":""},null,"",{"$f":"IF(C24=\"\",\"\",G24/VLOOKUP(C24,Sheet2!$A:$E,5,FALSE))","v":""},"",null,null,{"$f":"Sheet2!G:G","v":"Bottle Shop Liquor"},{"$f":"Sheet2!A:A","v":1550}]
[null,null,null,{"$f":"IF(C25=\"\",\"\",VLOOKUP(C25,Sheet2!$A:$B,2,FALSE))","v":""},{"$f":"IF(C25=\"\",\"\",VLOOKUP(C25,Sheet2!$A:$D,4,FALSE))","v":""},null,"",{"$f":"IF(C25=\"\",\"\",G25/VLOOKUP(C25,Sheet2!$A:$E,5,FALSE))","v":""},"",null,null,{"$f":"Sheet2!G:G","v":"Breckenridge Ale House"},{"$f":"Sheet2!A:A","v":1551}]
[null,null,null,{"$f":"IF(C26=\"\",\"\",VLOOKUP(C26,Sheet2!$A:$B,2,FALSE))","v":""},{"$f":"IF(C26=\"\",\"\",VLOOKUP(C26,Sheet2!$A:$D,4,FALSE))","v":""},null,"",{"$f":"IF(C26=\"\",\"\",G26/VLOOKUP(C26,Sheet2!$A:$E,5,FALSE))","v":""},"",null,null,{"$f":"Sheet2!G:G","v":"Broadway Liquors"},{"$f":"Sheet2!A:A","v":2006}]
[null,null,null,{"$f":"IF(C27=\"\",\"\",VLOOKUP(C27,Sheet2!$A:$B,2,FALSE))","v":""},{"$f":"IF(C27=\"\",\"\",VLOOKUP(C27,Sheet2!$A:$D,4,FALSE))","v":""},null,"",{"$f":"IF(C27=\"\",\"\",G27/VLOOKUP(C27,Sheet2!$A:$E,5,FALSE))","v":""},"",null,null,{"$f":"Sheet2!G:G","v":"C&H Spirit Solutions"},{"$f":"Sheet2!A:A","v":2058}]
[null,null,null,{"$f":"IF(C28=\"\",\"\",VLOOKUP(C28,Sheet2!$A:$B,2,FALSE))","v":""},{"$f":"IF(C28=\"\",\"\",VLOOKUP(C28,Sheet2!$A:$D,4,FALSE))","v":""},null,"",{"$f":"IF(C28=\"\",\"\",G28/VLOOKUP(C28,Sheet2!$A:$E,5,FALSE))","v":""},"",null,null,{"$f":"Sheet2!G:G","v":"Carelli's Pizzeria"},{"$f":"Sheet2!A:A","v":3008}]
[null,null,null,{"$f":"IF(C29=\"\",\"\",VLOOKUP(C29,Sheet2!$A:$B,2,FALSE))","v":""},{"$f":"IF(C29=\"\",\"\",VLOOKUP(C29,Sheet2!$A:$D,4,FALSE))","v":""},null,"",{"$f":"IF(C29=\"\",\"\",G29/VLOOKUP(C29,Sheet2!$A:$E,5,FALSE))","v":""},"",null,null,{"$f":"Sheet2!G:G","v":"Carl's Pharmacy"},{"$f":"Sheet2!A:A","v":3081}]
[null,null,null,null,null,null,null,"Total:",{"$f":"SUM(I10:I29)","v":0},null,null,{"$f":"Sheet2!G:G","v":"Carl's Tavern"},{"$f":"Sheet2!A:A","v":3082}]
{"$rows_left_out":561}
{"sheet":"Sheet2","index":2,"n_rows":321,"n_cols":11,"rows_kept":321,"cut":false,"hidden":false,"merged":[]}
[null,null,"Denver","Mountain",null,null,"626 On Rood",70082,"626 On Rood",null,"Grand Junction"]
[1000,"La Famiglia Chardonnay 12/750m",{"$f":"VLOOKUP(A2,'[1]October 2011'!$A:$T,20,FALSE)","v":75.48},{"$f":"VLOOKUP(A2,'[1]Mountain Pricing'!$A:$T,20,FALSE)","v":88.32},{"$f":"VLOOKUP(A2,'[1]October 2011'!$A:$C,3,FALSE)","v":12},null,"7 Hermits Brewing Co",70208,"717 Sylvan Lake Rd",null,"Eagle"]
[1001,"La Famiglia Cabernet 12/750ml",{"$f":"VLOOKUP(A3,'[1]October 2011'!$A:$T,20,FALSE)","v":75.48},{"$f":"VLOOKUP(A3,'[1]Mountain Pricing'!$A:$T,20,FALSE)","v":88.32},{"$f":"VLOOKUP(A3,'[1]October 2011'!$A:$C,3,FALSE)","v":12},null,"All Pro Liquors",70000,"2914 F Rd. Unit 104","","Grand Junction"]
[1002,"La Famiglia Merlot 12/750ml",{"$f":"VLOOKUP(A4,'[1]October 2011'!$A:$T,20,FALSE)","v":75.48},{"$f":"VLOOKUP(A4,'[1]Mountain Pricing'!$A:$T,20,FALSE)","v":88.32},{"$f":"VLOOKUP(A4,'[1]October 2011'!$A:$C,3,FALSE)","v":12},null,"Allegria",70153,"335 Main St.",null,"Carbondale"]
[1003,"La Famiglia Pinot Grigio 12/75",{"$f":"VLOOKUP(A5,'[1]October 2011'!$A:$T,20,FALSE)","v":75.48},{"$f":"VLOOKUP(A5,'[1]Mountain Pricing'!$A:$T,20,FALSE)","v":88.32},{"$f":"VLOOKUP(A5,'[1]October 2011'!$A:$C,3,FALSE)","v":12},null,"Alpine Wine & Spirit",70117,"2109 N Frontage Rd",null,"Vail"]
[1004,"La Famiglia Petite Sirah 12/75",{"$f":"VLOOKUP(A6,'[1]October 2011'!$A:$T,20,FALSE)","v":75.48},{"$f":"VLOOKUP(A6,'[1]Mountain Pricing'!$A:$T,20,FALSE)","v":88.32},{"$f":"VLOOKUP(A6,'[1]October 2011'!$A:$C,3,FALSE)","v":12},null,"Andy's Liquor Mart",70001,"922 N First St.","","Grand Junction"]
[1005,"La Famiglia Pinot Noir 12/750m",{"$f":"VLOOKUP(A7,'[1]October 2011'!$A:$T,20,FALSE)","v":92.28},{"$f":"VLOOKUP(A7,'[1]Mountain Pricing'!$A:$T,20,FALSE)","v":104.4},{"$f":"VLOOKUP(A7,'[1]October 2011'!$A:$C,3,FALSE)","v":12},null,"Antlers Discount Liquors",70205,"842 N Summit Blvd",null,"Frisco"]
[1007,"La Famiglia Rosso 12/750ml",{"$f":"VLOOKUP(A8,'[1]October 2011'!$A:$T,20,FALSE)","v":75.48},{"$f":"VLOOKUP(A8,'[1]Mountain Pricing'!$A:$T,20,FALSE)","v":88.32},{"$f":"VLOOKUP(A8,'[1]October 2011'!$A:$C,3,FALSE)","v":12},null,"Apres",70200,"130 S. Main St.",null,"Breckenridge"]
[1008,"La Famiglia Rosso Dolce 12/750ml",{"$f":"VLOOKUP(A9,'[1]October 2011'!$A:$T,20,FALSE)","v":75.48},{"$f":"VLOOKUP(A9,'[1]Mountain Pricing'!$A:$T,20,FALSE)","v":88.32},{"$f":"VLOOKUP(A9,'[1]October 2011'!$A:$C,3,FALSE)","v":12},null,"Arapahoe Basin Ski Area",70135,"28194 US Hwy 6",null,"Keystone"]
[1009,"La Famiglia Sauvignon Blanc 12/750ml",{"$f":"VLOOKUP(A10,'[1]October 2011'!$A:$T,20,FALSE)","v":75.48},{"$f":"VLOOKUP(A10,'[1]Mountain Pricing'!$A:$T,20,FALSE)","v":88.32},{"$f":"VLOOKUP(A10,'[1]October 2011'!$A:$C,3,FALSE)","v":12},null,"Arctic Liquors","70101","2093 Curve Plaza C-104",null,"Steamboat Springs"]
[1010,"La Famiglia Zinfandel 12/750ml",{"$f":"VLOOKUP(A11,'[1]October 2011'!$A:$T,20,FALSE)","v":75.48},{"$f":"VLOOKUP(A11,'[1]Mountain Pricing'!$A:$T,20,FALSE)","v":88.32},{"$f":"VLOOKUP(A11,'[1]October 2011'!$A:$C,3,FALSE)","v":12},null,"Aspen Wine and Spirits",70002,"300 Puppy Smith Rd.","","Aspen"]
[1020,"Black Diamond Merlot 12/750 ml",{"$f":"VLOOKUP(A12,'[1]October 2011'!$A:$T,20,FALSE)","v":159.47999999999999},{"$f":"VLOOKUP(A12,'[1]Mountain Pricing'!$A:$T,20,FALSE)","v":160.68},{"$f":"VLOOKUP(A12,'[1]October 2011'!$A:$C,3,FALSE)","v":12},null,"Aspen Wine Guild",70121,"319 Hopkins Ave.",null,"Aspen"]
[1021,"Black Diamond DC Cab 12/750ml",{"$f":"VLOOKUP(A13,'[1]October 2011'!$A:$T,20,FALSE)","v":159.47999999999999},{"$f":"VLOOKUP(A13,'[1]Mountain Pricing'!$A:$T,20,FALSE)","v":160.68},{"$f":"VLOOKUP(A13,'[1]October 2011'!$A:$C,3,FALSE)","v":12},null,"Avon Liquors",70003,"PO Box 1487","100 W Beaver Creek Blvd.","Avon"]
[1022,"Black Diamond Pinot Noir 12/750ml",{"$f":"VLOOKUP(A14,'[1]October 2011'!$A:$T,20,FALSE)","v":159.47999999999999},{"$f":"VLOOKUP(A14,'[1]Mountain Pricing'!$A:$T,20,FALSE)","v":160.68},{"$f":"VLOOKUP(A14,'[1]October 2011'!$A:$C,3,FALSE)","v":12},null,"Barley, The",70241,"635 Lincoln Ave.",null,"Steamboat Springs"]
[1023,"Black Diamond Zinfandel 12/750ml",{"$f":"VLOOKUP(A15,'[1]October 2011'!$A:$T,20,FALSE)","v":159.47999999999999},{"$f":"VLOOKUP(A15,'[1]Mountain Pricing'!$A:$T,20,FALSE)","v":160.68},{"$f":"VLOOKUP(A15,'[1]October 2011'!$A:$C,3,FALSE)","v":12},null,"Bart & Yeti's",70090,"551 E. Lionshead Cr.",null,"Vail"]
[1024,"Black Diamond Chardonnay 12/750 ml",{"$f":"VLOOKUP(A16,'[1]October 2011'!$A:$T,20,FALSE)","v":142.68},{"$f":"VLOOKUP(A16,'[1]Mountain Pricing'!$A:$T,20,FALSE)","v":144.72},{"$f":"VLOOKUP(A16,'[1]October 2011'!$A:$C,3,FALSE)","v":12},null,"Beaver Liquors",70004,"PO Box 488","110 E Bever Creek Blvd.","Avon"]
[1109,"Guadagni Chianti 12/750ml",{"$f":"VLOOKUP(A17,'[1]October 2011'!$A:$T,20,FALSE)","v":100.68},{"$f":"VLOOKUP(A17,'[1]Mountain Pricing'!$A:$T,20,FALSE)","v":104.4},{"$f":"VLOOKUP(A17,'[1]October 2011'!$A:$C,3,FALSE)","v":12},null,"Big House Burgers",70188,"2093 Curve Plaza C-101",null,"Steamboat Springs"]
[1209,"Guadagni Chianti Straw 09 12/7",{"$f":"VLOOKUP(A18,'[1]October 2011'!$A:$T,20,FALSE)","v":117.48},{"$f":"VLOOKUP(A18,'[1]Mountain Pricing'!$A:$T,20,FALSE)","v":120.48},{"$f":"VLOOKUP(A18,'[1]October 2011'!$A:$C,3,FALSE)","v":12},null,"Bistro CV",70108,"345 Lincoln Ave",null,"Steamboat Springs"]
[1220,"Guadagni Chianti Classico 12/750 ml",{"$f":"VLOOKUP(A19,'[1]October 2011'!$A:$T,20,FALSE)","v":125.88},{"$f":"VLOOKUP(A19,'[1]Mountain Pricing'!$A:$T,20,FALSE)","v":128.56},{"$f":"VLOOKUP(A19,'[1]October 2011'!$A:$C,3,FALSE)","v":12},null,"Black Diamond Bistro",70119,"120 Offerson Rd.",null,"Avon"]
[1406,"Guadagni Arielle 12/750ml",{"$f":"VLOOKUP(A20,'[1]October 2011'!$A:$T,20,FALSE)","v":134.28},{"$f":"VLOOKUP(A20,'[1]Mountain Pricing'!$A:$T,20,FALSE)","v":136.56},{"$f":"VLOOKUP(A20,'[1]October 2011'!$A:$C,3,FALSE)","v":12},null,"Blu's",70005,"193 E Gore Creek Dr.","","Vail"]
[1450,"Guadagni Rose 12/750ml",{"$f":"VLOOKUP(A21,'[1]October 2011'!$A:$T,20,FALSE)","v":109.08},{"$f":"VLOOKUP(A21,'[1]Mountain Pricing'!$A:$T,20,FALSE)","v":112.44},{"$f":"VLOOKUP(A21,'[1]October 2011'!$A:$C,3,FALSE)","v":12},null,"Bookcliff Country Club",70075,"2730 G Road",null,"Grand Junction"]
[1510,"Guadagni Orvieto 12/750ml",{"$f":"VLOOKUP(A22,'[1]October 2011'!$A:$T,20,FALSE)","v":92.28},{"$f":"VLOOKUP(A22,'[1]Mountain Pricing'!$A:$T,20,FALSE)","v":96.36},{"$f":"VLOOKUP(A22,'[1]October 2011'!$A:$C,3,FALSE)","v":12},null,"Bookcliff Liquors",70068,"3026 Patterson Rd.",null,"Grand Junction"]
[1515,"Guadagni Lago di Corbara",{"$f":"VLOOKUP(A23,'[1]October 2011'!$A:$T,20,FALSE)","v":159.47999999999999},{"$f":"VLOOKUP(A23,'[1]Mountain Pricing'!$A:$T,20,FALSE)","v":160.72},{"$f":"VLOOKUP(A23,'[1]October 2011'!$A:$C,3,FALSE)","v":12},null,"Bottle Pass Liquors",70231,"35 county Rd 804 Unit 1A",null,"Fraser"]
[1550,"Palazzo Sangiovese",{"$f":"VLOOKUP(A24,'[1]October 2011'!$A:$T,20,FALSE)","v":109.2},{"$f":"VLOOKUP(A24,'[1]Mountain Pricing'!$A:$T,20,FALSE)","v":112.44},{"$f":"VLOOKUP(A24,'[1]October 2011'!$A:$C,3,FALSE)","v":12},null,"Bottle Shop Liquor",70214,"40 Cove Blvd Unit C1",null,"Dillon"]
[1551,"Palazzo Pinot Grigio",{"$f":"VLOOKUP(A25,'[1]October 2011'!$A:$T,20,FALSE)","v":109.2},{"$f":"VLOOKUP(A25,'[1]Mountain Pricing'!$A:$T,20,FALSE)","v":112.44},{"$f":"VLOOKUP(A25,'[1]October 2011'!$A:$C,3,FALSE)","v":12},null,"Breckenridge Ale House",70006,"2531 N 12th St.","","Grand Junction"]
[2006,"Torre di Ciardo 12/750ml",{"$f":"VLOOKUP(A26,'[1]October 2011'!$A:$T,20,FALSE)","v":159.47999999999999},{"$f":"VLOOKUP(A26,'[1]Mountain Pricing'!$A:$T,20,FALSE)","v":160.72},{"$f":"VLOOKUP(A26,'[1]October 2011'!$A:$C,3,FALSE)","v":12},null,"Broadway Liquors",70055,"PO Box 391","403 Broadway","Eagle"]
[2058,"Torrigiani Chianti 12/750ml",{"$f":"VLOOKUP(A27,'[1]October 2011'!$A:$T,20,FALSE)","v":125.88},{"$f":"VLOOKUP(A27,'[1]Mountain Pricing'!$A:$T,20,FALSE)","v":144.6},{"$f":"VLOOKUP(A27,'[1]October 2011'!$A:$C,3,FALSE)","v":12},null,"C&H Spirit Solutions",70074,"1 Willow Bridge Rd",null,"Vail"]
[3008,"Guidaccio  6/750ml",{"$f":"VLOOKUP(A28,'[1]October 2011'!$A:$T,20,FALSE)","v":159.6},{"$f":"VLOOKUP(A28,'[1]Mountain Pricing'!$A:$T,20,FALSE)","v":168.84},{"$f":"VLOOKUP(A28,'[1]October 2011'!$A:$C,3,FALSE)","v":6},null,"Carelli's Pizzeria",70130,"465 Yampa Ave.",null,"Craig"]
[3081,"Magnifico Lavender Honey 12/750 ml",243.6,243.6,{"$f":"VLOOKUP(A29,'[1]October 2011'!$A:$C,3,FALSE)","v":12},null,"Carl's Pharmacy",70133,"306 E. Main",null,"Aspen"]
[3082,"Magnifico Ginger Peche 12/750 ml",243.6,243.6,{"$f":"VLOOKUP(A30,'[1]October 2011'!$A:$C,3,FALSE)","v":12},null,"Carl's Tavern",70163,"700 Yampa St. #103",null,"Steamboat Springs"]
{"$rows_left_out":292}
{"sheet":"Sheet3","index":3,"n_rows":0,"n_cols":0,"rows_kept":0,"cut":false,"hidden":false,"merged":[]}